Reaction Details
TargetDual specificity protein phosphatase 3
LigandBDBM51141
Substrate/Competitorn/a
Meas. Tech.uHTS absorbance assay for the identification of compounds that inhibit VHR1.
IC50 3490±n/a nM
Citation PubChem, PC uHTS absorbance assay for the identification of compounds that inhibit VHR1. PubChem Bioassay(2009)[AID]
 
Dual specificity protein phosphatase 3
Name:Dual specificity protein phosphatase 3
Type:Hydrolase
Mol. Mass.:20480.58
Organism:Homo sapiens (Human)
Description:n/a
Residue:185
BDBM51141
NameBDBM51141
Synonyms:2-[4-[(Z)-[3-[2-(1H-indol-3-yl)ethyl]-2-(4-methoxyphenyl)imino-4-oxidanylidene-1,3-thiazolidin-5-ylidene]methyl]phenoxy]ethanoic acid 2-[4-[(Z)-[3-[2-(1H-indol-3-yl)ethyl]-2-(4-methoxyphenyl)imino-4-oxo-5-thiazolidinylidene]methyl]phenoxy]acetic acid MLS000704894 [4-({3-[2-(1H-indol-3-yl)ethyl]-2-[(4-methoxyphenyl)imino]-4-oxo-1,3-thiazolidin-5-ylidene}methyl)phenoxy]acetic acid | cid_5995173
TypeSmall organic molecule
Emp. Form.C29H25N3O5S
Mol. Mass.527.591
SMILESCOc1ccc(cc1)\N=C1/S\C(=C/c2ccc(OCC(O)=O)cc2)C(=O)N1CCc1c[nH]c2ccccc12