Reaction Details
TargetDual specificity protein phosphatase 3
LigandBDBM46213
Substrate/Competitorn/a
Meas. Tech.uHTS absorbance assay for the identification of compounds that inhibit VHR1.
IC50 9180±n/a nM
Citation PubChem, PC uHTS absorbance assay for the identification of compounds that inhibit VHR1. PubChem Bioassay(2009)[AID]
 
Dual specificity protein phosphatase 3
Name:Dual specificity protein phosphatase 3
Type:Hydrolase
Mol. Mass.:20480.58
Organism:Homo sapiens (Human)
Description:n/a
Residue:185
BDBM46213
NameBDBM46213
Synonyms:2-[4-[[6-carbethoxy-3-keto-7-methyl-5-[4-(methylthio)phenyl]-5H-thiazolo[3,2-a]pyrimidin-2-ylidene]methyl]phenoxy]acetic acid 2-[4-[[6-ethoxycarbonyl-7-methyl-5-(4-methylsulfanylphenyl)-3-oxo-5H-[1,3]thiazolo[3,2-a]pyrimidin-2-ylidene]methyl]phenoxy]acetic acid ML120 cid_4302116
TypeSmall organic molecule
Emp. Form.C26H24N2O6S2
Mol. Mass.524.609
SMILESCCOC(=O)C1=C(C)N=c2sc(=Cc3ccc(OCC(O)=O)cc3)c(=O)n2C1c1ccc(SC)cc1