Reaction Details
TargetTyrosine-protein phosphatase non-receptor type 22
LigandBDBM46235
Substrate/Competitorn/a
Meas. Tech.uHTS identification of small molecule inhibitors of LYP via a fluorescence intensity assay
IC50 12586.36±n/a nM
Citation PubChem, PC uHTS identification of small molecule inhibitors of LYP via a fluorescence intensity assay PubChem Bioassay(2009)[AID]
 
Tyrosine-protein phosphatase non-receptor type 22
Name:Tyrosine-protein phosphatase non-receptor type 22
Type:n/a
Mol. Mass.:91712.31
Organism:Homo sapiens (Human)
Description:Q9Y2R2
Residue:807
BDBM46235
NameBDBM46235
Synonyms:4-[[2-bromanyl-4-[(E)-2-cyano-2-(3-fluorophenyl)ethenyl]phenoxy]methyl]benzoic acid 4-[[2-bromo-4-[(E)-2-cyano-2-(3-fluorophenyl)vinyl]phenoxy]methyl]benzoic acid cid_2229326
TypeSmall organic molecule
Emp. Form.C23H15BrFNO3
Mol. Mass.452.273
SMILESOC(=O)c1ccc(COc2ccc(\C=C(\C#N)c3cccc(F)c3)cc2Br)cc1