Reaction Details
TargetTyrosine-protein phosphatase non-receptor type 22
LigandBDBM47669
Substrate/Competitorn/a
Meas. Tech.uHTS identification of small molecule inhibitors of LYP via a fluorescence intensity assay
IC50 5467.981±n/a nM
Citation PubChem, PC uHTS identification of small molecule inhibitors of LYP via a fluorescence intensity assay PubChem Bioassay(2009)[AID]
 
Tyrosine-protein phosphatase non-receptor type 22
Name:Tyrosine-protein phosphatase non-receptor type 22
Type:n/a
Mol. Mass.:91712.31
Organism:Homo sapiens (Human)
Description:Q9Y2R2
Residue:807
BDBM47669
NameBDBM47669
Synonyms:3-(2-{(E)-[1-(4-chlorophenyl)-2,5-dioxoimidazolidin-4-ylidene]methyl}-1H-pyrrol-1-yl)benzoic acid 3-[2-[(E)-[1-(4-chlorophenyl)-2,5-diketo-imidazolidin-4-ylidene]methyl]pyrrol-1-yl]benzoic acid 3-[2-[(E)-[1-(4-chlorophenyl)-2,5-dioxoimidazolidin-4-ylidene]methyl]pyrrol-1-yl]benzoic acid SMR000313306 | cid_6104167
TypeSmall organic molecule
Emp. Form.C21H14ClN3O4
Mol. Mass.407.807
SMILESOC(=O)c1cccc(c1)-n1cccc1C=C1NC(=O)N(C1=O)c1ccc(Cl)cc1