Reaction Details
TargetLarge T antigen
LigandBDBM58948
Substrate/Competitorn/a
Meas. Tech.Identification of SV40 T antigen inhibitors: A route to novel anti-viral reagents
IC50 9480±n/a nM
Citation PubChem, PC Identification of SV40 T antigen inhibitors: A route to novel anti-viral reagents PubChem Bioassay(2010)[AID]
 
Large T antigen
Name:Large T antigen
Type:Enzyme Catalytic Domain
Mol. Mass.:81575.54
Organism:Simian virus 40
Description:P03070
Residue:708
BDBM58948
NameBDBM58948
Synonyms:4-[[4-(2-oxolanylmethylamino)-2-quinazolinyl]amino]phenol;hydrochloride 4-[[4-(tetrahydrofurfurylamino)quinazolin-2-yl]amino]phenol;hydrochloride MLS000026780 cid_2953078
TypeSmall organic molecule
Emp. Form.C19H20N4O2
Mol. Mass.336.3877
SMILESOc1ccc(Nc2nc(NCC3CCCO3)c3ccccc3n2)cc1