Reaction Details
TargetLarge T antigen
LigandBDBM60351
Substrate/Competitorn/a
Meas. Tech.Identification of SV40 T antigen inhibitors: A route to novel anti-viral reagents
IC50 3500±n/a nM
Citation PubChem, PC Identification of SV40 T antigen inhibitors: A route to novel anti-viral reagents PubChem Bioassay(2010)[AID]
 
Large T antigen
Name:Large T antigen
Type:Enzyme Catalytic Domain
Mol. Mass.:81575.54
Organism:Simian virus 40
Description:P03070
Residue:708
BDBM60351
NameBDBM60351
Synonyms:MLS000070198 cid_654792 | dibenzofuran-3,7-diol
TypeSmall organic molecule
Emp. Form.C12H8O3
Mol. Mass.200.1901
SMILESOc1ccc2c(c1)oc1cc(O)ccc21