Reaction Details
TargetLarge T antigen
LigandBDBM23926
Substrate/Competitorn/a
Meas. Tech.Identification of SV40 T antigen inhibitors: A route to novel anti-viral reagents
IC50 26200±n/a nM
Citation PubChem, PC Identification of SV40 T antigen inhibitors: A route to novel anti-viral reagents PubChem Bioassay(2010)[AID]
 
Large T antigen
Name:Large T antigen
Type:Enzyme Catalytic Domain
Mol. Mass.:81575.54
Organism:Simian virus 40
Description:P03070
Residue:708
BDBM23926
NameBDBM23926
Synonyms:(E)-resveratrol CHEMBL165 Stilbene, 2f cid_445154 trans-resveratrol
TypeSmall organic molecule
Emp. Form.C14H12O3
Mol. Mass.228.2433
SMILESOc1ccc(\C=C\c2cc(O)cc(O)c2)cc1