Reaction Details
TargetLarge T antigen
LigandBDBM60361
Substrate/Competitorn/a
Meas. Tech.Identification of SV40 T antigen inhibitors: A route to novel anti-viral reagents
IC50 9870±n/a nM
Citation PubChem, PC Identification of SV40 T antigen inhibitors: A route to novel anti-viral reagents PubChem Bioassay(2010)[AID]
 
Large T antigen
Name:Large T antigen
Type:Enzyme Catalytic Domain
Mol. Mass.:81575.54
Organism:Simian virus 40
Description:P03070
Residue:708
BDBM60361
NameBDBM60361
Synonyms:2-amino-5-(4-aminophenyl)-3-thiophenecarboxylic acid ethyl ester MLS000036250 cid_660523 ethyl 5-(4-aminophenyl)-2-azanyl-thiophene-3-carboxylate
TypeSmall organic molecule
Emp. Form.C13H14N2O2S
Mol. Mass.262.327
SMILESCCOC(=O)c1cc(sc1N)-c1ccc(N)cc1