Reaction Details
TargetLarge T antigen
LigandBDBM32060
Substrate/Competitorn/a
Meas. Tech.Identification of SV40 T antigen inhibitors: A route to novel anti-viral reagents
IC50 9840±n/a nM
Citation PubChem, PC Identification of SV40 T antigen inhibitors: A route to novel anti-viral reagents PubChem Bioassay(2010)[AID]
 
Large T antigen
Name:Large T antigen
Type:Enzyme Catalytic Domain
Mol. Mass.:81575.54
Organism:Simian virus 40
Description:P03070
Residue:708
BDBM32060
NameBDBM32060
Synonyms:MLS000053494 [4-(4-hydroxyphenyl)-1-piperazinyl]-(2-naphthalenyl)methanone [4-(4-hydroxyphenyl)piperazin-1-yl]-naphthalen-2-ylmethanone cid_2120761
TypeSmall organic molecule
Emp. Form.C21H20N2O2
Mol. Mass.332.3957
SMILESOc1ccc(cc1)N1CCN(CC1)C(=O)c1ccc2ccccc2c1