Reaction Details
TargetLarge T antigen
LigandBDBM60369
Substrate/Competitorn/a
Meas. Tech.Identification of SV40 T antigen inhibitors: A route to novel anti-viral reagents
IC50 7700±n/a nM
Citation PubChem, PC Identification of SV40 T antigen inhibitors: A route to novel anti-viral reagents PubChem Bioassay(2010)[AID]
 
Large T antigen
Name:Large T antigen
Type:Enzyme Catalytic Domain
Mol. Mass.:81575.54
Organism:Simian virus 40
Description:P03070
Residue:708
BDBM60369
NameBDBM60369
Synonyms:(2Z)-2-(1H-benzimidazol-2-yl)-2-(1-methyl-2-pyridinylidene)acetonitrile (2Z)-2-(1H-benzimidazol-2-yl)-2-(1-methylpyridin-2-ylidene)acetonitrile MLS000055643 cid_2998445
TypeSmall organic molecule
Emp. Form.C15H12N4
Mol. Mass.248.2826
SMILESCN1C=CC=C\C1=C(/C#N)c1nc2ccccc2[nH]1