Reaction Details
TargetLarge T antigen
LigandBDBM60382
Substrate/Competitorn/a
Meas. Tech.Identification of SV40 T antigen inhibitors: A route to novel anti-viral reagents
IC50 5410±n/a nM
Citation PubChem, PC Identification of SV40 T antigen inhibitors: A route to novel anti-viral reagents PubChem Bioassay(2010)[AID]
 
Large T antigen
Name:Large T antigen
Type:Enzyme Catalytic Domain
Mol. Mass.:81575.54
Organism:Simian virus 40
Description:P03070
Residue:708
BDBM60382
NameBDBM60382
Synonyms:3-[4-(4-hydroxyphenyl)-1-piperazinyl]-1-(2-thienylmethyl)-2,5-pyrrolidinedione 3-[4-(4-hydroxyphenyl)piperazin-1-yl]-1-(thiophen-2-ylmethyl)pyrrolidine-2,5-dione MLS000100290 cid_2981304
TypeSmall organic molecule
Emp. Form.C19H21N3O3S
Mol. Mass.371.453
SMILESOc1ccc(cc1)N1CCN(CC1)C1CC(=O)N(Cc2cccs2)C1=O