Reaction Details
TargetLarge T antigen
LigandBDBM33061
Substrate/Competitorn/a
Meas. Tech.Identification of SV40 T antigen inhibitors: A route to novel anti-viral reagents
IC50 8540±n/a nM
Citation PubChem, PC Identification of SV40 T antigen inhibitors: A route to novel anti-viral reagents PubChem Bioassay(2010)[AID]
 
Large T antigen
Name:Large T antigen
Type:Enzyme Catalytic Domain
Mol. Mass.:81575.54
Organism:Simian virus 40
Description:P03070
Residue:708
BDBM33061
NameBDBM33061
Synonyms:4-N,4-N-dimethyl-1-N-(4-pyridin-3-yl-1,3-thiazol-2-yl)benzene-1,4-diamine N4,N4-dimethyl-N1-(4-pyridin-3-yl-1,3-thiazol-2-yl)benzene-1,4-diamine SMR000104797 dimethyl-[4-[[4-(3-pyridyl)thiazol-2-yl]amino]phenyl]amine
TypeSmall organic molecule
Emp. Form.C16H16N4S
Mol. Mass.296.39
SMILESCN(C)c1ccc(Nc2nc(cs2)-c2cccnc2)cc1