Reaction Details
TargetG-protein coupled receptor 55
LigandBDBM61475
Substrate/Competitorn/a
Meas. Tech.Image-Based HTS for Selective Antagonists for GPR55
IC50 868.605±n/a nM
Citation PubChem, PC Image-Based HTS for Selective Antagonists for GPR55 PubChem Bioassay(2010)[AID]
 
G-protein coupled receptor 55
Name:G-protein coupled receptor 55
Type:PROTEIN
Mol. Mass.:36649.72
Organism:Homo sapiens (Human)
Description:ChEMBL_1292265
Residue:319
BDBM61475
NameBDBM61475
Synonyms:MLS000579674 N-(3-carbamoyl-4,5-dimethyl-2-thienyl)-2-(m-tolyl)cinchoninamide N-(3-carbamoyl-4,5-dimethylthiophen-2-yl)-2-(3-methylphenyl)quinoline-4-carboxamide SMR000186862 | cid_1358604
TypeSmall organic molecule
Emp. Form.C24H21N3O2S
Mol. Mass.415.507
SMILESCc1sc(NC(=O)c2cc(nc3ccccc23)-c2cccc(C)c2)c(C(N)=O)c1C