Reaction Details
TargetG-protein coupled receptor 55
LigandBDBM61536
Substrate/Competitorn/a
Meas. Tech.Image-Based HTS for Selective Antagonists for GPR55
IC50 696.0974±n/a nM
Citation PubChem, PC Image-Based HTS for Selective Antagonists for GPR55 PubChem Bioassay(2010)[AID]
 
G-protein coupled receptor 55
Name:G-protein coupled receptor 55
Type:PROTEIN
Mol. Mass.:36649.72
Organism:Homo sapiens (Human)
Description:ChEMBL_1292265
Residue:319
BDBM61536
NameBDBM61536
Synonyms:2-chloranyl-4,4-dimethyl-3-oxidanylidene-N-phenyl-pentanamide 2-chloro-4,4-dimethyl-3-oxo-N-phenylpentanamide SMR000280697 | cid_3091421
TypeSmall organic molecule
Emp. Form.C13H16ClNO2
Mol. Mass.253.725
SMILESCC(C)(C)C(=O)C(Cl)C(=O)Nc1ccccc1