Reaction Details
TargetG-protein coupled receptor 55
LigandBDBM47358
Substrate/Competitorn/a
Meas. Tech.Image-Based HTS for Selective Antagonists for GPR55
IC50 699.1816±n/a nM
Citation PubChem, PC Image-Based HTS for Selective Antagonists for GPR55 PubChem Bioassay(2010)[AID]
 
G-protein coupled receptor 55
Name:G-protein coupled receptor 55
Type:PROTEIN
Mol. Mass.:36649.72
Organism:Homo sapiens (Human)
Description:ChEMBL_1292265
Residue:319
BDBM47358
NameBDBM47358
Synonyms:MLS001005680 N,N-dimethyl-4-[(E)-2-(4-phenylbenzo[f]quinolin-4-ium-3-yl)ethenyl]aniline;chloride cid_16195997 | dimethyl-[4-[(E)-2-(4-phenylbenzo[f]quinolin-4-ium-3-yl)vinyl]phenyl]amine;chloride
TypeSmall organic molecule
Emp. Form.C29H25N2
Mol. Mass.401.5217
SMILESCN(C)c1ccc(\C=C\c2ccc3c(ccc4ccccc34)[n+]2-c2ccccc2)cc1