Reaction Details
TargetG-protein coupled receptor 35
LigandBDBM61652
Substrate/Competitorn/a
Meas. Tech.Image-Based HTS for Selective Antagonists of GPR35
IC50 500±n/a nM
Citation PubChem, PC Image-Based HTS for Selective Antagonists of GPR35 PubChem Bioassay(2010)[AID]
 
G-protein coupled receptor 35
Name:G-protein coupled receptor 35
Type:Enzyme Catalytic Domain
Mol. Mass.:34085.57
Organism:Homo sapiens (Human)
Description:gi_33695097
Residue:309
BDBM61652
NameBDBM61652
Synonyms:2-hydroxy-4-[[1-oxo-4-[(5Z)-4-oxo-5-(phenylmethylene)-2-sulfanylidene-3-thiazolidinyl]butyl]amino]benzoic acid 4-[4-[(5Z)-5-benzal-4-keto-2-thioxo-thiazolidin-3-yl]butanoylamino]-2-hydroxy-benzoic acid MLS001157852 cid_6226024
TypeSmall organic molecule
Emp. Form.C21H18N2O5S2
Mol. Mass.442.508
SMILESOC(=O)c1ccc(NC(=O)CCCN2C(=S)S\C(=C/c3ccccc3)C2=O)cc1O