Reaction Details
TargetVoltage-dependent N-type calcium channel subunit alpha-1B
LigandBDBM34513
Substrate/Competitorn/a
Meas. Tech.Homogeneous Time-Resolved Fluorescence Resonance Energy Transfer (HTRF) Assay
IC50 5660±n/a nM
Citation PubChem, PC Homogeneous Time-Resolved Fluorescence Resonance Energy Transfer (HTRF) Assay PubChem Bioassay(2009)[AID]
 
Voltage-dependent N-type calcium channel subunit alpha-1B
Name:Voltage-dependent N-type calcium channel subunit alpha-1B
Type:Enzyme
Mol. Mass.:262548.16
Organism:Homo sapiens (Human)
Description:Q00975
Residue:2339
BDBM34513
NameBDBM34513
Synonyms:MLS000118887 N-[2-(2,5-dimethoxyphenyl)ethyl]-2-(4,6-dimethyl-3-oxidanylidene-[1,2]thiazolo[5,4-b]pyridin-2-yl)ethanamide N-[2-(2,5-dimethoxyphenyl)ethyl]-2-(4,6-dimethyl-3-oxo-[1,2]thiazolo[5,4-b]pyridin-2-yl)acetamide US9011882, Table 1, Compound 15 | cid_5309169
TypeSmall organic molecule
Emp. Form.C20H23N3O4S
Mol. Mass.401.479
SMILESCOc1ccc(OC)c(CCNC(=O)Cn2sc3nc(C)cc(C)c3c2=O)c1