Reaction Details
TargetVoltage-dependent N-type calcium channel subunit alpha-1B
LigandBDBM51598
Substrate/Competitorn/a
Meas. Tech.Homogeneous Time-Resolved Fluorescence Resonance Energy Transfer (HTRF) Assay
IC50 1500±n/a nM
Citation PubChem, PC Homogeneous Time-Resolved Fluorescence Resonance Energy Transfer (HTRF) Assay PubChem Bioassay(2009)[AID]
 
Voltage-dependent N-type calcium channel subunit alpha-1B
Name:Voltage-dependent N-type calcium channel subunit alpha-1B
Type:Enzyme
Mol. Mass.:262548.16
Organism:Homo sapiens (Human)
Description:Q00975
Residue:2339
BDBM51598
NameBDBM51598
Synonyms:8-[(dimethylamino)methyl]-6-ethyl-3-(2-fluoranylphenoxy)-2-methyl-7-oxidanyl-chromen-4-one 8-[(dimethylamino)methyl]-6-ethyl-3-(2-fluorophenoxy)-7-hydroxy-2-methyl-chromone MLS000111897 cid_979757
TypeSmall organic molecule
Emp. Form.C21H22FNO4
Mol. Mass.371.4021
SMILESCCc1cc2c(oc(C)c(Oc3ccccc3F)c2=O)c(CN(C)C)c1O