Reaction Details
TargetVoltage-dependent N-type calcium channel subunit alpha-1B
LigandBDBM61667
Substrate/Competitorn/a
Meas. Tech.Homogeneous Time-Resolved Fluorescence Resonance Energy Transfer (HTRF) Assay
IC50 1680±n/a nM
Citation PubChem, PC Homogeneous Time-Resolved Fluorescence Resonance Energy Transfer (HTRF) Assay PubChem Bioassay(2009)[AID]
 
Voltage-dependent N-type calcium channel subunit alpha-1B
Name:Voltage-dependent N-type calcium channel subunit alpha-1B
Type:Enzyme
Mol. Mass.:262548.16
Organism:Homo sapiens (Human)
Description:Q00975
Residue:2339
BDBM61667
NameBDBM61667
Synonyms:6-amino-5-cyano-N-methyl-4-phenyl-2-sulfanylidene-3,4-dihydro-1H-pyridine-3-carboxamide 6-amino-5-cyano-N-methyl-4-phenyl-2-thioxo-3,4-dihydro-1H-pyridine-3-carboxamide MLS000543734 cid_2771297
TypeSmall organic molecule
Emp. Form.C14H14N4OS
Mol. Mass.286.352
SMILESCNC(=O)C1C(C(C#N)C(=N)NC1=S)c1ccccc1