Reaction Details
TargetVoltage-dependent N-type calcium channel subunit alpha-1B
LigandBDBM75323
Substrate/Competitorn/a
Meas. Tech.Homogeneous Time-Resolved Fluorescence Resonance Energy Transfer (HTRF) Assay
IC50 10100±n/a nM
Citation PubChem, PC Homogeneous Time-Resolved Fluorescence Resonance Energy Transfer (HTRF) Assay PubChem Bioassay(2009)[AID]
 
Voltage-dependent N-type calcium channel subunit alpha-1B
Name:Voltage-dependent N-type calcium channel subunit alpha-1B
Type:Enzyme
Mol. Mass.:262548.16
Organism:Homo sapiens (Human)
Description:Q00975
Residue:2339
BDBM75323
NameBDBM75323
Synonyms:2-[4-[[[4-[2-(4-chloroanilino)-1,3-thiazol-4-yl]benzoyl]hydrazinylidene]methyl]phenoxy]acetic acid 2-[4-[[[4-[2-[(4-chlorophenyl)amino]-1,3-thiazol-4-yl]phenyl]carbonylhydrazinylidene]methyl]phenoxy]ethanoic acid MLS000703184 cid_3143384
TypeSmall organic molecule
Emp. Form.C25H19ClN4O4S
Mol. Mass.506.961
SMILESOC(=O)COc1ccc(C=NNC(=O)c2ccc(cc2)-c2csc(Nc3ccc(Cl)cc3)n2)cc1