Reaction Details
TargetVoltage-dependent N-type calcium channel subunit alpha-1B
LigandBDBM54763
Substrate/Competitorn/a
Meas. Tech.Homogeneous Time-Resolved Fluorescence Resonance Energy Transfer (HTRF) Assay
IC50 3350±n/a nM
Citation PubChem, PC Homogeneous Time-Resolved Fluorescence Resonance Energy Transfer (HTRF) Assay PubChem Bioassay(2009)[AID]
 
Voltage-dependent N-type calcium channel subunit alpha-1B
Name:Voltage-dependent N-type calcium channel subunit alpha-1B
Type:Enzyme
Mol. Mass.:262548.16
Organism:Homo sapiens (Human)
Description:Q00975
Residue:2339
BDBM54763
NameBDBM54763
Synonyms:4-[[3-chloranyl-1,4-bis(oxidanylidene)naphthalen-2-yl]-ethanoyl-amino]benzoic acid 4-[acetyl-(3-chloro-1,4-diketo-2-naphthyl)amino]benzoic acid 4-[acetyl-(3-chloro-1,4-dioxonaphthalen-2-yl)amino]benzoic acid SMR000555847 | cid_24761366
TypeSmall organic molecule
Emp. Form.C19H12ClNO5
Mol. Mass.369.755
SMILESCC(=O)N(C1=C(Cl)C(=O)c2ccccc2C1=O)c1ccc(cc1)C(O)=O