Reaction Details
TargetVoltage-dependent N-type calcium channel subunit alpha-1B
LigandBDBM51786
Substrate/Competitorn/a
Meas. Tech.Homogeneous Time-Resolved Fluorescence Resonance Energy Transfer (HTRF) Assay
IC50 3130±n/a nM
Citation PubChem, PC Homogeneous Time-Resolved Fluorescence Resonance Energy Transfer (HTRF) Assay PubChem Bioassay(2009)[AID]
 
Voltage-dependent N-type calcium channel subunit alpha-1B
Name:Voltage-dependent N-type calcium channel subunit alpha-1B
Type:Enzyme
Mol. Mass.:262548.16
Organism:Homo sapiens (Human)
Description:Q00975
Residue:2339
BDBM51786
NameBDBM51786
Synonyms:3-[((2Z)-5-[(acetyloxy)methyl]-3-{[(2,4-dimethoxyphenyl)amino]carbonyl}-8-methyl-2H-pyrano[2,3-c]pyridin-2-ylidene)amino]benzoic acid 3-[[5-(acetyloxymethyl)-3-[(2,4-dimethoxyanilino)-oxomethyl]-8-methyl-2-pyrano[2,3-c]pyridinylidene]amino]benzoic acid 3-[[5-(acetyloxymethyl)-3-[(2,4-dimethoxyphenyl)carbamoyl]-8-methylpyrano[2,3-c]pyridin-2-ylidene]amino]benzoic acid SMR000564168 | cid_4413344
TypeSmall organic molecule
Emp. Form.C28H25N3O8
Mol. Mass.531.5134
SMILESCOc1ccc(NC(=O)c2cc3c(COC(C)=O)cnc(C)c3o\c2=N/c2cccc(c2)C(O)=O)c(OC)c1