Reaction Details
TargetVoltage-dependent N-type calcium channel subunit alpha-1B
LigandBDBM61758
Substrate/Competitorn/a
Meas. Tech.Homogeneous Time-Resolved Fluorescence Resonance Energy Transfer (HTRF) Assay
IC50 14500±n/a nM
Citation PubChem, PC Homogeneous Time-Resolved Fluorescence Resonance Energy Transfer (HTRF) Assay PubChem Bioassay(2009)[AID]
 
Voltage-dependent N-type calcium channel subunit alpha-1B
Name:Voltage-dependent N-type calcium channel subunit alpha-1B
Type:Enzyme
Mol. Mass.:262548.16
Organism:Homo sapiens (Human)
Description:Q00975
Residue:2339
BDBM61758
NameBDBM61758
Synonyms:3-[(5Z)-4-keto-5-[2-keto-1-[2-keto-2-(p-anisidino)ethyl]indolin-3-ylidene]-2-thioxo-thiazolidin-3-yl]propionic acid 3-[(5Z)-5-[1-[2-(4-methoxyanilino)-2-oxoethyl]-2-oxoindol-3-ylidene]-4-oxo-2-sulfanylidene-1,3-thiazolidin-3-yl]propanoic acid MLS001083009 cid_1889464
TypeSmall organic molecule
Emp. Form.C23H19N3O6S2
Mol. Mass.497.543
SMILESCOc1ccc(NC(=O)CN2C(=O)\C(=C3/SC(=S)N(CCC(O)=O)C3=O)c3ccccc23)cc1