Reaction Details
TargetNeuropeptide Y receptor type 2
LigandBDBM25756
Substrate/Competitorn/a
Meas. Tech.Fluorescence-based cell-based high-throughput dose response assay for agonists of NPY-Y2.
EC50 16153±n/a nM
Citation PubChem, PC Fluorescence-based cell-based high-throughput dose response assay for agonists of NPY-Y2. PubChem Bioassay(2009)[AID]
 
Neuropeptide Y receptor type 2
Name:Neuropeptide Y receptor type 2
Type:Enzyme Catalytic Domain
Mol. Mass.:42734.65
Organism:Homo sapiens (Human)
Description:NPY-Y2 NPY2R HUMAN::P49146
Residue:381
BDBM25756
NameBDBM25756
Synonyms:(2R,3R)-2,3-dihydroxysuccinic acid;1-(isopropylamino)-3-[4-(2-methoxyethyl)phenoxy]propan-2-ol CHEMBL13 Spesicor metoprolol tartrate | {2-hydroxy-3-[4-(2-methoxyethyl)phenoxy]propyl}(propan-2-yl)amine
TypeSmall organic molecule
Emp. Form.C15H25NO3
Mol. Mass.267.3639
SMILESCOCCc1ccc(OCC(O)CNC(C)C)cc1