Reaction Details
TargetBcl-2-like protein 1
LigandBDBM31750
Substrate/Competitorn/a
Meas. Tech.Counterscreen for inhibitors of MCL1: fluorescence polarization-based biochemical high throughput dose response assay for inhibitors of BCL2-related protein, long isoform (BCLXL).
IC50 108803±n/a nM
Citation PubChem, PC Counterscreen for inhibitors of MCL1: fluorescence polarization-based biochemical high throughput dose response assay for inhibitors of BCL2-related protein, long isoform (BCLXL). PubChem Bioassay(2009)[AID]
 
Bcl-2-like protein 1
Name:Bcl-2-like protein 1
Type:Mitochondrion membrane; Single-pass membrane protein
Mol. Mass.:26039.60
Organism:Homo sapiens (Human)
Description:n/a
Residue:233
BDBM31750
NameBDBM31750
Synonyms:5,6-bis(2-furanyl)-3-(methylthio)-1,2,4-triazine 5,6-bis(furan-2-yl)-3-methylsulfanyl-1,2,4-triazine cid_3053058
TypeSmall organic molecule
Emp. Form.C12H9N3O2S
Mol. Mass.259.284
SMILESCSc1nnc(-c2ccco2)c(n1)-c1ccco1