Reaction Details
TargetBcl-2-like protein 1
LigandBDBM31755
Substrate/Competitorn/a
Meas. Tech.Counterscreen for inhibitors of MCL1: fluorescence polarization-based biochemical high throughput dose response assay for inhibitors of BCL2-related protein, long isoform (BCLXL).
IC50 108803±n/a nM
Citation PubChem, PC Counterscreen for inhibitors of MCL1: fluorescence polarization-based biochemical high throughput dose response assay for inhibitors of BCL2-related protein, long isoform (BCLXL). PubChem Bioassay(2009)[AID]
 
Bcl-2-like protein 1
Name:Bcl-2-like protein 1
Type:Mitochondrion membrane; Single-pass membrane protein
Mol. Mass.:26039.60
Organism:Homo sapiens (Human)
Description:n/a
Residue:233
BDBM31755
NameBDBM31755
Synonyms:3-(benzylthio)-5,6-bis(2-furyl)-1,2,4-triazine 5,6-bis(2-furanyl)-3-(phenylmethylthio)-1,2,4-triazine MLS-0029114.0001 | cid_2940938
TypeSmall organic molecule
Emp. Form.C18H13N3O2S
Mol. Mass.335.38
SMILESC(Sc1nnc(-c2ccco2)c(n1)-c1ccco1)c1ccccc1