Reaction Details
TargetRegulator of G-protein signaling 4
LigandBDBM46590
Substrate/Competitorn/a
Meas. Tech.Dose response, multiplexed high-throughput screen for small molecule regulators of RGS family protein interactions, specifically RGS4-Galphao for SAR compounds
Ki 1020±n/a nM
Citation PubChem, PC Dose response, multiplexed high-throughput screen for small molecule regulators of RGS family protein interactions, specifically RGS4-Galphao for SAR compounds PubChem Bioassay(2010)[AID]
 
Regulator of G-protein signaling 4
Name:Regulator of G-protein signaling 4
Type:Enzyme
Mol. Mass.:23263.51
Organism:Homo sapiens (Human)
Description:P49798
Residue:205
BDBM46590
NameBDBM46590
Synonyms:4-[2-[(E)-(2,3-dihydroxy-4-oxocyclohexa-2,5-dien-1-ylidene)methyl]hydrazinyl]-3-nitrobenzenesulfonamide 4-[N'-[(E)-(2,3-dihydroxy-4-keto-cyclohexa-2,5-dien-1-ylidene)methyl]hydrazino]-3-nitro-benzenesulfonamide MLS000759826 cid_5982653
TypeSmall organic molecule
Emp. Form.C13H12N4O7S
Mol. Mass.368.322
SMILESNS(=O)(=O)c1ccc(N=[NH+]Cc2ccc([O-])c(O)c2O)c(c1)[N+]([O-])=O