Reaction Details
TargetRegulator of G-protein signaling 7
LigandBDBM47735
Substrate/Competitorn/a
Meas. Tech.Dose response, multiplexed high-throughput screen for small molecule regulators of RGS family protein interactions, specifically RGS7-Galphao for SAR Compounds
EC50 30000±n/a nM
Citation PubChem, PC Dose response, multiplexed high-throughput screen for small molecule regulators of RGS family protein interactions, specifically RGS7-Galphao for SAR Compounds PubChem Bioassay(2010)[AID]
 
Regulator of G-protein signaling 7
Name:Regulator of G-protein signaling 7
Type:Enzyme Catalytic Domain
Mol. Mass.:57675.72
Organism:Homo sapiens (Human)
Description:P49802
Residue:495
BDBM47735
NameBDBM47735
Synonyms:3-chloranyl-N-(3,3-dimethylbutan-2-yl)-6-nitro-1-benzothiophene-2-carboxamide 3-chloro-6-nitro-N-(1,2,2-trimethylpropyl)benzothiophene-2-carboxamide MLS000583265 cid_2971539
TypeSmall organic molecule
Emp. Form.C15H17ClN2O3S
Mol. Mass.340.825
SMILESCC(NC(=O)c1sc2cc(ccc2c1Cl)[N+]([O-])=O)C(C)(C)C