Reaction Details
TargetRegulator of G-protein signaling 7
LigandBDBM47815
Substrate/Competitorn/a
Meas. Tech.Dose response, multiplexed high-throughput screen for small molecule regulators of RGS family protein interactions, specifically RGS7-Galphao for SAR Compounds
EC50 356±n/a nM
Citation PubChem, PC Dose response, multiplexed high-throughput screen for small molecule regulators of RGS family protein interactions, specifically RGS7-Galphao for SAR Compounds PubChem Bioassay(2010)[AID]
 
Regulator of G-protein signaling 7
Name:Regulator of G-protein signaling 7
Type:Enzyme Catalytic Domain
Mol. Mass.:57675.72
Organism:Homo sapiens (Human)
Description:P49802
Residue:495
BDBM47815
NameBDBM47815
Synonyms:2-(4-Methoxy-phenyl)-[1,4]benzoquinone 2-(4-methoxyphenyl)cyclohexa-2,5-diene-1,4-dione SMR000427749 | cid_121637
TypeSmall organic molecule
Emp. Form.C13H10O3
Mol. Mass.214.2167
SMILESCOc1ccc(cc1)C1=CC(=O)C=CC1=O