Reaction Details
TargetRegulator of G-protein signaling 7
LigandBDBM34972
Substrate/Competitorn/a
Meas. Tech.Dose response, multiplexed high-throughput screen for small molecule regulators of RGS family protein interactions, specifically RGS7-Galphao for SAR Compounds
EC50 421±n/a nM
Citation PubChem, PC Dose response, multiplexed high-throughput screen for small molecule regulators of RGS family protein interactions, specifically RGS7-Galphao for SAR Compounds PubChem Bioassay(2010)[AID]
 
Regulator of G-protein signaling 7
Name:Regulator of G-protein signaling 7
Type:Enzyme Catalytic Domain
Mol. Mass.:57675.72
Organism:Homo sapiens (Human)
Description:P49802
Residue:495
BDBM34972
NameBDBM34972
Synonyms:MLS000759648 N''-[(E)-(2,3-dihydroxy-4-oxocyclohexa-2,5-dien-1-ylidene)methyl]-2-(2-morpholin-4-yl-1,3-thiazol-4-yl)acetohydrazide N''-[(Z)-(2,3-dihydroxy-4-keto-cyclohexa-2,5-dien-1-ylidene)methyl]-2-(2-morpholinothiazol-4-yl)acetohydrazide N'-[(Z)-(2,3-dihydroxy-4-keto-cyclohexa-2,5-dien-1-ylidene)methyl]-2-(2-morpholinothiazol-4-yl)acetohydrazide cid_6508305
TypeSmall organic molecule
Emp. Form.C16H18N4O5S
Mol. Mass.378.403
SMILESOc1ccc(C=NNC(=O)Cc2csc(n2)N2CCOCC2)c(O)c1O