Reaction Details
TargetRegulator of G-protein signaling 7
LigandBDBM47798
Substrate/Competitorn/a
Meas. Tech.Dose response, multiplexed high-throughput screen for small molecule regulators of RGS family protein interactions, specifically RGS7-Galphao for SAR Compounds
EC50 269±n/a nM
Citation PubChem, PC Dose response, multiplexed high-throughput screen for small molecule regulators of RGS family protein interactions, specifically RGS7-Galphao for SAR Compounds PubChem Bioassay(2010)[AID]
 
Regulator of G-protein signaling 7
Name:Regulator of G-protein signaling 7
Type:Enzyme Catalytic Domain
Mol. Mass.:57675.72
Organism:Homo sapiens (Human)
Description:P49802
Residue:495
BDBM47798
NameBDBM47798
Synonyms:4-chloranyl-6-(4,6-dimethylpyrimidin-2-yl)sulfanyl-N-methyl-1,3,5-triazin-2-amine 4-chloro-6-[(4,6-dimethyl-2-pyrimidinyl)thio]-N-methyl-1,3,5-triazin-2-amine SMR000288800 cid_1087037
TypeSmall organic molecule
Emp. Form.C10H11ClN6S
Mol. Mass.282.753
SMILESCNc1nc(Cl)nc(Sc2nc(C)cc(C)n2)n1