Reaction Details
TargetRegulator of G-protein signaling 7
LigandBDBM47734
Substrate/Competitorn/a
Meas. Tech.Dose response, multiplexed high-throughput screen for small molecule regulators of RGS family protein interactions, specifically RGS7-Galphao for SAR Compounds
Ki 3750±n/a nM
Citation PubChem, PC Dose response, multiplexed high-throughput screen for small molecule regulators of RGS family protein interactions, specifically RGS7-Galphao for SAR Compounds PubChem Bioassay(2010)[AID]
 
Regulator of G-protein signaling 7
Name:Regulator of G-protein signaling 7
Type:Enzyme Catalytic Domain
Mol. Mass.:57675.72
Organism:Homo sapiens (Human)
Description:P49802
Residue:495
BDBM47734
NameBDBM47734
Synonyms:MLS000553854 N-[(8-Hydroxy-5-nitro-quinolin-7-yl)-p-tolyl-methyl]-propionamide N-[(8-hydroxy-5-nitro-7-quinolyl)-(p-tolyl)methyl]propionamide SMR000172089 | cid_2922056
TypeSmall organic molecule
Emp. Form.C20H19N3O4
Mol. Mass.365.3826
SMILESCCC(=O)NC(c1ccc(C)cc1)c1cc([N+]([O-])=O)c2cccnc2c1O