Reaction Details
TargetRegulator of G-protein signaling 7
LigandBDBM43363
Substrate/Competitorn/a
Meas. Tech.Dose response, multiplexed high-throughput screen for small molecule regulators of RGS family protein interactions, specifically RGS7-Galphao for SAR Compounds
Ki 130±n/a nM
Citation PubChem, PC Dose response, multiplexed high-throughput screen for small molecule regulators of RGS family protein interactions, specifically RGS7-Galphao for SAR Compounds PubChem Bioassay(2010)[AID]
 
Regulator of G-protein signaling 7
Name:Regulator of G-protein signaling 7
Type:Enzyme Catalytic Domain
Mol. Mass.:57675.72
Organism:Homo sapiens (Human)
Description:P49802
Residue:495
BDBM43363
NameBDBM43363
Synonyms:2,5-bis(chloranyl)-3-piperidin-1-yl-6-(2-piperidin-1-yl-1,3-thiazol-5-yl)cyclohexa-2,5-diene-1,4-dione 2,5-dichloro-3-(1-piperidinyl)-6-[2-(1-piperidinyl)-5-thiazolyl]cyclohexa-2,5-diene-1,4-dione 2,5-dichloro-3-piperidino-6-(2-piperidinothiazol-5-yl)-p-benzoquinone SMR000115104 | cid_406171
TypeSmall organic molecule
Emp. Form.C19H21Cl2N3O2S
Mol. Mass.426.36
SMILESClC1=C(N2CCCCC2)C(=O)C(Cl)=C(c2cnc(s2)N2CCCCC2)C1=O