Reaction Details
TargetRegulator of G-protein signaling 7
LigandBDBM62209
Substrate/Competitorn/a
Meas. Tech.Dose response, multiplexed high-throughput screen for small molecule regulators of RGS family protein interactions, specifically RGS7-Galphao for SAR Compounds
Ki 120±n/a nM
Citation PubChem, PC Dose response, multiplexed high-throughput screen for small molecule regulators of RGS family protein interactions, specifically RGS7-Galphao for SAR Compounds PubChem Bioassay(2010)[AID]
 
Regulator of G-protein signaling 7
Name:Regulator of G-protein signaling 7
Type:Enzyme Catalytic Domain
Mol. Mass.:57675.72
Organism:Homo sapiens (Human)
Description:P49802
Residue:495
BDBM62209
NameBDBM62209
Synonyms:UNM-0000305796 | cid_18559023
TypeSmall organic molecule
Emp. Form.C25H23N3O4S
Mol. Mass.461.533
SMILESNc1c(sc2nc3\C(CCc3c(-c3ccco3)c12)=C/c1ccco1)C(=O)NCC1CCCO1