Reaction Details
TargetRegulator of G-protein signaling 16
LigandBDBM38361
Substrate/Competitorn/a
Meas. Tech.Dose response, multiplexed high-throughput screen for small molecule regulators of RGS family protein interactions, specifically RGS16-Galphao for SAR Compounds
EC50 27±49.05 nM
Citation PubChem, PC Dose response, multiplexed high-throughput screen for small molecule regulators of RGS family protein interactions, specifically RGS16-Galphao for SAR Compounds PubChem Bioassay(2010)[AID]
 
Regulator of G-protein signaling 16
Name:Regulator of G-protein signaling 16
Type:Enzyme Catalytic Domain
Mol. Mass.:22748.87
Organism:Homo sapiens (Human)
Description:gi_156416009
Residue:202
BDBM38361
NameBDBM38361
Synonyms:2-(4-pyrrolidin-1-ylsulfonylphenyl)-1,2-benzothiazol-3-one 2-[4-(1-pyrrolidinylsulfonyl)phenyl]-1,2-benzothiazol-3-one SMR000060746 | cid_2325816
TypeSmall organic molecule
Emp. Form.C17H16N2O3S2
Mol. Mass.360.451
SMILESO=c1n(sc2ccccc12)-c1ccc(cc1)S(=O)(=O)N1CCCC1