Reaction Details
TargetRegulator of G-protein signaling 16
LigandBDBM62221
Substrate/Competitorn/a
Meas. Tech.Dose response, multiplexed high-throughput screen for small molecule regulators of RGS family protein interactions, specifically RGS16-Galphao for SAR Compounds
EC50 30000±0 nM
Citation PubChem, PC Dose response, multiplexed high-throughput screen for small molecule regulators of RGS family protein interactions, specifically RGS16-Galphao for SAR Compounds PubChem Bioassay(2010)[AID]
 
Regulator of G-protein signaling 16
Name:Regulator of G-protein signaling 16
Type:Enzyme Catalytic Domain
Mol. Mass.:22748.87
Organism:Homo sapiens (Human)
Description:gi_156416009
Residue:202
BDBM62221
NameBDBM62221
Synonyms:2-(4,6-dimethylisoxazolo[5,4-b]pyridin-3-yl)oxy-1-[3-methyl-4-(m-tolyl)piperazino]ethanone 2-[(4,6-dimethyl-[1,2]oxazolo[5,4-b]pyridin-3-yl)oxy]-1-[3-methyl-4-(3-methylphenyl)piperazin-1-yl]ethanone cid_44473132
TypeSmall organic molecule
Emp. Form.C22H26N4O3
Mol. Mass.394.4668
SMILESCC1CN(CCN1c1cccc(C)c1)C(=O)COc1noc2nc(C)cc(C)c12