Reaction Details
TargetRegulator of G-protein signaling 16
LigandBDBM33090
Substrate/Competitorn/a
Meas. Tech.Dose response, multiplexed high-throughput screen for small molecule regulators of RGS family protein interactions, specifically RGS16-Galphao for SAR Compounds
Ki 850±n/a nM
Citation PubChem, PC Dose response, multiplexed high-throughput screen for small molecule regulators of RGS family protein interactions, specifically RGS16-Galphao for SAR Compounds PubChem Bioassay(2010)[AID]
 
Regulator of G-protein signaling 16
Name:Regulator of G-protein signaling 16
Type:Enzyme Catalytic Domain
Mol. Mass.:22748.87
Organism:Homo sapiens (Human)
Description:gi_156416009
Residue:202
BDBM33090
NameBDBM33090
Synonyms:(4E)-4-[[(2-ethylimino-4-methyl-1,3-thiazol-3-yl)amino]methylidene]-2,3-bis(oxidanyl)cyclohexa-2,5-dien-1-one (4E)-4-[[(2-ethylimino-4-methyl-3-thiazolyl)amino]methylidene]-2,3-dihydroxy-1-cyclohexa-2,5-dienone (4Z)-4-[[(2-ethylimino-4-methyl-4-thiazolin-3-yl)amino]methylene]-2,3-dihydroxy-cyclohexa-2,5-dien-1-one SMR000151702 | cid_5825518
TypeSmall organic molecule
Emp. Form.C13H15N3O3S
Mol. Mass.293.342
SMILESCCN=c1scc(C)n1N=Cc1ccc(O)c(O)c1O