Reaction Details
TargetRegulator of G-protein signaling 8
LigandBDBM46667
Substrate/Competitorn/a
Meas. Tech.Dose response, multiplexed high-throughput screen for small molecule regulators of RGS family protein interactions, specifically RGS8-Galphao for SAR Compounds
EC50 30000±n/a nM
Citation PubChem, PC Dose response, multiplexed high-throughput screen for small molecule regulators of RGS family protein interactions, specifically RGS8-Galphao for SAR Compounds PubChem Bioassay(2010)[AID]
 
Regulator of G-protein signaling 8
Name:Regulator of G-protein signaling 8
Type:Enzyme Catalytic Domain
Mol. Mass.:20925.80
Organism:Homo sapiens (Human)
Description:gi_74355113
Residue:180
BDBM46667
NameBDBM46667
Synonyms:2-phenyl-1,2-benzothiazol-3-one MLS-0107957.0001 cid_164981
TypeSmall organic molecule
Emp. Form.C13H9NOS
Mol. Mass.227.282
SMILESO=c1n(sc2ccccc12)-c1ccccc1