Reaction Details
TargetRegulator of G-protein signaling 8
LigandBDBM33145
Substrate/Competitorn/a
Meas. Tech.Dose response, multiplexed high-throughput screen for small molecule regulators of RGS family protein interactions, specifically RGS8-Galphao for SAR Compounds
Ki 340±n/a nM
Citation PubChem, PC Dose response, multiplexed high-throughput screen for small molecule regulators of RGS family protein interactions, specifically RGS8-Galphao for SAR Compounds PubChem Bioassay(2010)[AID]
 
Regulator of G-protein signaling 8
Name:Regulator of G-protein signaling 8
Type:Enzyme Catalytic Domain
Mol. Mass.:20925.80
Organism:Homo sapiens (Human)
Description:gi_74355113
Residue:180
BDBM33145
NameBDBM33145
Synonyms:3-[[[(E)-(2,3-dihydroxy-4-keto-cyclohexa-2,5-dien-1-ylidene)methyl]amino]carbamoyl]-N,N-diethyl-benzenesulfonamide 3-[[[(E)-(2,3-dihydroxy-4-oxocyclohexa-2,5-dien-1-ylidene)methyl]amino]carbamoyl]-N,N-diethylbenzenesulfonamide 3-[[[(Z)-(2,3-dihydroxy-4-keto-cyclohexa-2,5-dien-1-ylidene)methyl]amino]carbamoyl]-N,N-diethyl-benzenesulfonamide SMR000244048 | cid_6263555
TypeSmall organic molecule
Emp. Form.C18H21N3O6S
Mol. Mass.407.441
SMILESCCN(CC)S(=O)(=O)c1cccc(c1)C(=O)NN=Cc1ccc(O)c(O)c1O