Reaction Details
TargetSerine/threonine-protein kinase Sgk1
LigandBDBM268628
Substrate/Competitorn/a
Meas. Tech.Enzymatic Activity Assay
pH7.4±n/a
IC50<1.20±n/a nM
Commentsextracted
Citation Nazare, MHalland, NSchmidt, FKleemann, HWeiss, TSaas, JStruebing, C N-(4-(azaindazol-6-yl)-phenyl)-sulfonamides and their use as pharmaceuticals US Patent US9718825 Publication Date 8/1/2017
 
Serine/threonine-protein kinase Sgk1
Name:Serine/threonine-protein kinase Sgk1
Type:Other Protein Type
Mol. Mass.:48954.40
Organism:Homo sapiens (Human)
Description:Recombinant human SGK-1 enzyme produced in a baculovirus system.
Residue:431
BDBM268628
NameBDBM268628
Synonyms:US9718825, Example 25
TypeSmall organic molecule
Emp. Form.C22H14Cl2N6O2S
Mol. Mass.497.357
SMILESClc1ccc(Cl)c(c1)S(=O)(=O)Nc1ccc(cc1)-c1nc(-c2ccncc2)c2cn[nH]c2n1