Reaction Details
TargetSerine/threonine-protein kinase Sgk1
LigandBDBM268629
Substrate/Competitorn/a
Meas. Tech.Enzymatic Activity Assay
pH7.4±n/a
IC50<1.20±n/a nM
Commentsextracted
Citation Nazare, MHalland, NSchmidt, FKleemann, HWeiss, TSaas, JStruebing, C N-(4-(azaindazol-6-yl)-phenyl)-sulfonamides and their use as pharmaceuticals US Patent US9718825 Publication Date 8/1/2017
 
Serine/threonine-protein kinase Sgk1
Name:Serine/threonine-protein kinase Sgk1
Type:Other Protein Type
Mol. Mass.:48954.40
Organism:Homo sapiens (Human)
Description:Recombinant human SGK-1 enzyme produced in a baculovirus system.
Residue:431
BDBM268629
NameBDBM268629
Synonyms:US9718825, Example 26
TypeSmall organic molecule
Emp. Form.C22H14ClFN6O3S
Mol. Mass.496.901
SMILESFc1ccc(Cl)cc1S(=O)(=O)Nc1ccc(cc1)-c1nc(Oc2cccnc2)c2cn[nH]c2n1