Reaction Details
TargetSerine/threonine-protein kinase Sgk1
LigandBDBM268847
Substrate/Competitorn/a
Meas. Tech.Enzymatic Activity Assay
pH7.4±n/a
IC50 1.10±n/a nM
Commentsextracted
Citation Nazare, MHalland, NSchmidt, FKleemann, HWeiss, TSaas, JStruebing, C N-(4-(azaindazol-6-yl)-phenyl)-sulfonamides and their use as pharmaceuticals US Patent US9718825 Publication Date 8/1/2017
 
Serine/threonine-protein kinase Sgk1
Name:Serine/threonine-protein kinase Sgk1
Type:Other Protein Type
Mol. Mass.:48954.40
Organism:Homo sapiens (Human)
Description:Recombinant human SGK-1 enzyme produced in a baculovirus system.
Residue:431
BDBM268847
NameBDBM268847
Synonyms:US9718825, Example 252
TypeSmall organic molecule
Emp. Form.C24H23F3N6O3S
Mol. Mass.532.538
SMILESCc1n[nH]c2nc(nc(OC3CCNCC3(F)F)c12)-c1ccc(NS(=O)(=O)c2cc(C)ccc2F)cc1