Reaction Details
TargetSerine/threonine-protein kinase Sgk1
LigandBDBM269083
Substrate/Competitorn/a
Meas. Tech.Enzymatic Activity Assay
pH7.4±n/a
IC50<0.510±n/a nM
Commentsextracted
Citation Nazare, MHalland, NSchmidt, FKleemann, HWeiss, TSaas, JStruebing, C N-(4-(azaindazol-6-yl)-phenyl)-sulfonamides and their use as pharmaceuticals US Patent US9718825 Publication Date 8/1/2017
 
Serine/threonine-protein kinase Sgk1
Name:Serine/threonine-protein kinase Sgk1
Type:Other Protein Type
Mol. Mass.:48954.40
Organism:Homo sapiens (Human)
Description:Recombinant human SGK-1 enzyme produced in a baculovirus system.
Residue:431
BDBM269083
NameBDBM269083
Synonyms:US9718825, Example 527
TypeSmall organic molecule
Emp. Form.C18H15FN6O3S
Mol. Mass.414.414
SMILESCOc1ccc(F)c(c1)S(=O)(=O)Nc1ccc(cc1)-c1ncc2c(N)n[nH]c2n1