Reaction Details
TargetSerine/threonine-protein kinase Sgk1
LigandBDBM269090
Substrate/Competitorn/a
Meas. Tech.Enzymatic Activity Assay
pH7.4±n/a
IC50<1.50±n/a nM
Commentsextracted
Citation Nazare, MHalland, NSchmidt, FKleemann, HWeiss, TSaas, JStruebing, C N-(4-(azaindazol-6-yl)-phenyl)-sulfonamides and their use as pharmaceuticals US Patent US9718825 Publication Date 8/1/2017
 
Serine/threonine-protein kinase Sgk1
Name:Serine/threonine-protein kinase Sgk1
Type:Other Protein Type
Mol. Mass.:48954.40
Organism:Homo sapiens (Human)
Description:Recombinant human SGK-1 enzyme produced in a baculovirus system.
Residue:431
BDBM269090
NameBDBM269090
Synonyms:2,5-Dichloro-N-[2-methoxy-4-(3-methyl-1H-pyrazolo[3,4-d]pyrimidin-6-yl)-phenyl]-benzenesulfonamide | US9718825, Example 534
TypeSmall organic molecule
Emp. Form.C19H15Cl2N5O3S
Mol. Mass.464.325
SMILESCOc1cc(ccc1NS(=O)(=O)c1cc(Cl)ccc1Cl)-c1ncc2c(C)n[nH]c2n1