Reaction Details
TargetSerine/threonine-protein kinase Sgk1
LigandBDBM269150
Substrate/Competitorn/a
Meas. Tech.Enzymatic Activity Assay
pH7.4±n/a
IC50<0.500±n/a nM
Commentsextracted
Citation Nazare, MHalland, NSchmidt, FKleemann, HWeiss, TSaas, JStruebing, C N-(4-(azaindazol-6-yl)-phenyl)-sulfonamides and their use as pharmaceuticals US Patent US9718825 Publication Date 8/1/2017
 
Serine/threonine-protein kinase Sgk1
Name:Serine/threonine-protein kinase Sgk1
Type:Other Protein Type
Mol. Mass.:48954.40
Organism:Homo sapiens (Human)
Description:Recombinant human SGK-1 enzyme produced in a baculovirus system.
Residue:431
BDBM269150
NameBDBM269150
Synonyms:US9718825, Example 596
TypeSmall organic molecule
Emp. Form.C21H20FN5O3S
Mol. Mass.441.479
SMILESCCOc1nc(cc2[nH]nc(N)c12)-c1ccc(NS(=O)(=O)c2cc(C)ccc2F)cc1