Reaction Details
TargetEpstein-Barr nuclear antigen 1
LigandBDBM62409
Substrate/Competitorn/a
Meas. Tech.Fluorescence polarization-based biochemical high throughput dose response assay for inhibitors of the Epstein-Barr virus nuclear antigen 1 (EBNA-1)
IC50 6092±n/a nM
Citation PubChem, PC Fluorescence polarization-based biochemical high throughput dose response assay for inhibitors of the Epstein-Barr virus nuclear antigen 1 (EBNA-1) PubChem Bioassay(2010)[AID]
 
Epstein-Barr nuclear antigen 1
Name:Epstein-Barr nuclear antigen 1
Type:Enzyme Catalytic Domain
Mol. Mass.:56444.81
Organism:Human herpesvirus 4
Description:gi_23893623
Residue:641
BDBM62409
NameBDBM62409
Synonyms:3-[4-[(3-fluorophenyl)carbamoylamino]piperidino]sulfonylbenzoic acid methyl ester 3-{4-[3-(3-Fluoro-phenyl)-ureido]-piperidine-1-sulfonyl}-benzoic acid methyl ester SMR000006741 methyl 3-[4-[(3-fluorophenyl)carbamoylamino]piperidin-1-yl]sulfonylbenzoate
TypeSmall organic molecule
Emp. Form.C20H22FN3O5S
Mol. Mass.435.469
SMILESCOC(=O)c1cccc(c1)S(=O)(=O)N1CCC(CC1)NC(=O)Nc1cccc(F)c1