Reaction Details
TargetEpstein-Barr nuclear antigen 1
LigandBDBM62444
Substrate/Competitorn/a
Meas. Tech.Fluorescence polarization-based biochemical high throughput dose response assay for inhibitors of the Epstein-Barr virus nuclear antigen 1 (EBNA-1)
IC50 7234±n/a nM
Citation PubChem, PC Fluorescence polarization-based biochemical high throughput dose response assay for inhibitors of the Epstein-Barr virus nuclear antigen 1 (EBNA-1) PubChem Bioassay(2010)[AID]
 
Epstein-Barr nuclear antigen 1
Name:Epstein-Barr nuclear antigen 1
Type:Enzyme Catalytic Domain
Mol. Mass.:56444.81
Organism:Human herpesvirus 4
Description:gi_23893623
Residue:641
BDBM62444
NameBDBM62444
Synonyms:2-{N'-[5-(Benzenesulfonylamino-methyl)-furan-2-ylmethylene]-hydrazino}-N-(4-ethoxy-phenyl)-2-oxo-acetamide N'-[[5-(benzenesulfonamidomethyl)-2-furanyl]methylideneamino]-N-(4-ethoxyphenyl)oxamide N'-[[5-(benzenesulfonamidomethyl)furan-2-yl]methylideneamino]-N-(4-ethoxyphenyl)oxamide SMR000172100 | cid_3139240
TypeSmall organic molecule
Emp. Form.C22H22N4O6S
Mol. Mass.470.498
SMILESCCOc1ccc(NC(=O)C(=O)NN=Cc2ccc(CNS(=O)(=O)c3ccccc3)o2)cc1