Reaction Details
TargetEpstein-Barr nuclear antigen 1
LigandBDBM62494
Substrate/Competitorn/a
Meas. Tech.Fluorescence polarization-based biochemical high throughput dose response assay for inhibitors of the Epstein-Barr virus nuclear antigen 1 (EBNA-1)
IC50 6659±n/a nM
Citation PubChem, PC Fluorescence polarization-based biochemical high throughput dose response assay for inhibitors of the Epstein-Barr virus nuclear antigen 1 (EBNA-1) PubChem Bioassay(2010)[AID]
 
Epstein-Barr nuclear antigen 1
Name:Epstein-Barr nuclear antigen 1
Type:Enzyme Catalytic Domain
Mol. Mass.:56444.81
Organism:Human herpesvirus 4
Description:gi_23893623
Residue:641
BDBM62494
NameBDBM62494
Synonyms:1-(2-fluorophenyl)-3-(5-veratryl-1,3,4-thiadiazol-2-yl)urea MLS001183471 cid_1335528
TypeSmall organic molecule
Emp. Form.C18H17FN4O3S
Mol. Mass.388.416
SMILESCOc1ccc(Cc2nnc(NC(=O)Nc3ccccc3F)s2)cc1OC