Reaction Details
TargetEpstein-Barr nuclear antigen 1
LigandBDBM62498
Substrate/Competitorn/a
Meas. Tech.Fluorescence polarization-based biochemical high throughput dose response assay for inhibitors of the Epstein-Barr virus nuclear antigen 1 (EBNA-1)
IC50 6913±n/a nM
Citation PubChem, PC Fluorescence polarization-based biochemical high throughput dose response assay for inhibitors of the Epstein-Barr virus nuclear antigen 1 (EBNA-1) PubChem Bioassay(2010)[AID]
 
Epstein-Barr nuclear antigen 1
Name:Epstein-Barr nuclear antigen 1
Type:Enzyme Catalytic Domain
Mol. Mass.:56444.81
Organism:Human herpesvirus 4
Description:gi_23893623
Residue:641
BDBM62498
NameBDBM62498
Synonyms:2-cyclopropyl-5-[4-[4-(3-methoxyphenyl)piperazin-1-yl]sulfonylphenyl]-1,3-oxazole 2-cyclopropyl-5-[4-[[4-(3-methoxyphenyl)-1-piperazinyl]sulfonyl]phenyl]oxazole SMR000631514 | cid_16027935
TypeSmall organic molecule
Emp. Form.C23H25N3O4S
Mol. Mass.439.527
SMILESCOc1cccc(c1)N1CCN(CC1)S(=O)(=O)c1ccc(cc1)-c1cnc(o1)C1CC1