Reaction Details
TargetSerine/threonine-protein phosphatase
LigandBDBM36903
Substrate/Competitorn/a
Meas. Tech.Luminesence Cell-Based Secondary Assay to Identify Inhibitors of Calcineurin
EC50 180000±n/a nM
Citation PubChem, PC Luminesence Cell-Based Secondary Assay to Identify Inhibitors of Calcineurin PubChem Bioassay(2010)[AID]
 
Serine/threonine-protein phosphatase
Name:Serine/threonine-protein phosphatase
Type:Enzyme Catalytic Domain
Mol. Mass.:69558.03
Organism:Candida dubliniensis CD36
Description:gi_223640082
Residue:607
BDBM36903
NameBDBM36903
Synonyms:1-[(2,4-dimethoxyphenyl)-(4-morpholinyl)methyl]-2-naphthalenol 1-[(2,4-dimethoxyphenyl)-morpholin-4-ylmethyl]naphthalen-2-ol MLS000039063 cid_621551
TypeSmall organic molecule
Emp. Form.C23H25NO4
Mol. Mass.379.4489
SMILESCOc1ccc(C(N2CCOCC2)c2c(O)ccc3ccccc23)c(OC)c1